{"text_format":"1","workbook":"xlsx","n_sheets":6,"sheets":["Anexo_T1","CAT","EQUIPOS","ANALITOS","PENAS","RESUMEN"],"not_rendered":{"charts":0,"images":1,"macros":1,"external_links":0,"defined_names":67,"comments":0,"pivot_tables":0},"unopened":[],"bounds":{"document_bytes":16777216,"sheet_cells":100000,"rows_first":2000,"rows_last":500,"rows_between":2000,"halvings":0,"cell_chars":16384,"cell_head_chars":4096},"cells_cut":0,"cells_raw":0,"read":"whole","date_system":"1900"}

{"sheet":"Anexo_T1","index":0,"n_rows":1303,"n_cols":33,"rows_kept":1303,"cut":false,"hidden":true,"merged":[[1,15,3,15],[1,16,3,16],[1,25,1,32],[2,27,2,28],[2,29,2,30],[2,31,2,32],[1,17,1,24],[2,17,2,18],[2,19,2,20],[2,21,2,22],[2,23,2,24],[2,25,2,26],[1,2,3,2],[1,11,3,11],[1,12,3,12],[0,0,0,32],[1,0,3,0],[1,1,3,1],[1,3,3,3],[1,4,3,4],[1,5,3,5],[1,6,3,6],[1,7,3,7],[1,8,3,8],[1,9,3,9],[1,10,3,10],[1,13,3,13],[1,14,3,14]]}
["Anexo T1 (uno) Requerimiento del SMI de BCS 2023 - 2025 (UNIDADES MÉDICAS)"]
["No.","Partida","Región","Clave OOAD","OOAD/UMAE","Clave Presupuestal","Nivel de Atención","UNIDAD","TIPO_SERV","NO_UNIDAD","LOCALIDAD","Tipo de Servicio","Paquete","CLV_GPO","GRUPO","CLV_ESTUDIO","ESTUDIO","C A N T I D A D E S  (R E F E R E N C I A L E S)",null,null,null,null,null,null,null,"P R E S U P U E S T O"]
[null,null,null,null,null,null,null,null,null,null,null,null,null,null,null,null,null,"Requerimiento\nPeriodo 2023-2025",null,"2023\nfecha de emisión y notificación del fallo-diciembre",null,"2024\nenero-diciembre",null,"2025\nenero-abril",null,"Importe\nPeriodo 2023-2025",null,"Importe sin IVA\n2023\n(fecha de emisión y notificación del fallo-diciembre)",null,"Importe sin IVA\n2024\nenero-diciembre",null,"Importe sin IVA\n2025\nenero-abril"]
[null,null,null,null,null,null,null,null,null,null,null,null,null,null,null,null,null,"Minimo","Máximo","Minimo","Máximo","Minimo","Máximo","Minimo","Máximo","Minimo","Máximo","Minimo","Máximo","Minimo","Máximo","Minimo","Máximo"]
[1,1,"A","02","Baja California","020501142151",null,"HGOMF 7 Tijuana","HGOMF","007","Tijuana","Banco de Sangre","I","01","Sangre Total Segura","50.01.01","Sangre Total Segura",18816,47040,6272,15680,9408,23520,3136,7840,22202880,55507200,7400960,18502400,11101440,27753600,3700480,9251200]
[2,1,"A","02","Baja California","020101012151",null,"HGZ 30 Mexicali","HGZ","030","Mexicali","Banco de Sangre","I","01","Sangre Total Segura","50.01.01","Sangre Total Segura",9280,23200,3093,7733,4640,11600,1547,3867,10950400,27376000,3649740,9124940,5475200,13688000,1825460,4563060]
[3,1,"A","03","Baja California Sur","030103022151",null,"HGZMF 1 La Paz","HGZMF","001","La Paz","Banco de Sangre","I","01","Sangre Total Segura","50.01.01","Sangre Total Segura",8930,22322,2976,7441,4465,11161,1489,3720,10537400,26339960,3511680,8780380,5268700,13169980,1757020,4389600]
[4,1,"A","27","Sonora","270101012151",null,"HGZ 2 Hermosillo  ","HGZ","002","Hermosillo","Banco de Sangre","I","01","Sangre Total Segura","50.01.01","Sangre Total Segura",10920,27300,3640,9100,5460,13650,1820,4550,12885600,32214000,4295200,10738000,6442800,16107000,2147600,5369000]
{"$rows_left_out":1296}
{"sheet":"CAT","index":1,"n_rows":245,"n_cols":13,"rows_kept":245,"cut":false,"hidden":true,"merged":[]}
["OOAD/UMAE","Clave OOAD",null,null,"Partida","Clave OOAD","OOAD/UMAE","Nivel de Atención","UNIDAD","Clave Presupuestal",null,"PAQUETE","PROVEEDOR"]
["Aguascalientes","01","AGS",null,1,"01","Aguascalientes","Segundo Nivel","HGZ 1 Aguascalientes","010101012151",null,"I","Genesis Healthcare Advisers, S.A. de C.V. en participación conjunta con Logística Marvil, S.A. de C.V."]
["Baja California","02","BCN",null,1,"01","Aguascalientes","Segundo Nivel","HGZ 2 Aguascalientes","010126012151",null,"II","Biodist, S.A. de C.V."]
["Baja California Sur","03","BCS",null,1,"01","Aguascalientes","Segundo Nivel","HGZ 3 Jesús María","012004012151",null,"VI","Genesis Healthcare Advisers, S.A. de C.V. en participación conjunta con Logística Marvil, S.A. de C.V."]
["Campeche","04","CAM",null,2,"02","Baja California","Segundo Nivel","HGZ 30 Mexicali","020101012151"]
["Coahuila","05","COA",null,2,"02","Baja California","Segundo Nivel","HGPMF 31 Mexicali","020115182151"]
["Colima","06","COL",null,2,"02","Baja California","Segundo Nivel","HGS 6 Tecate","020201082151"]
["Chiapas","07","CHP",null,2,"02","Baja California","Segundo Nivel","HGZMF 8 Ensenada","020301022151"]
{"$rows_left_out":238}
{"sheet":"EQUIPOS","index":2,"n_rows":41,"n_cols":10,"rows_kept":41,"cut":false,"hidden":false,"merged":[]}
["NO_EQP","CLV_GPO","GRUPO","MARCA","MODELO","NS","EQUIPO","RUTINA","URGENCIAS","AÑO"]
["EQ01","01","Sangre Total Segura"]
["EQ02","01","Sangre Total Segura"]
["EQ03","01","Sangre Total Segura"]
["EQ04","01","Sangre Total Segura"]
["EQ05","01","Sangre Total Segura"]
["EQ06","02","Aféresis"]
["EQ07","02","Aféresis"]
{"$rows_left_out":34}
{"sheet":"ANALITOS","index":3,"n_rows":707,"n_cols":14,"rows_kept":707,"cut":false,"hidden":false,"merged":[[10,7,10,8],[11,3,11,4],[11,5,11,6],[11,7,11,8],[5,2,6,2],[5,9,5,10],[5,11,5,12],[5,7,6,8],[8,3,8,4],[8,5,8,6],[8,7,8,8],[9,3,9,4],[9,5,9,6],[9,7,9,8],[7,5,7,6],[7,7,7,8],[5,3,6,4],[7,3,7,4],[18,3,18,4],[18,5,18,6],[18,7,18,8],[19,3,19,4],[19,5,19,6],[19,7,19,8],[16,3,16,4],[16,5,16,6],[16,7,16,8],[17,3,17,4],[17,5,17,6],[17,7,17,8],[5,0,6,0],[5,5,6,6],[0,2,0,5],[1,2,1,5],[2,2,2,5],[3,2,3,5],[14,3,14,4],[14,5,14,6],[14,7,14,8],[15,3,15,4],[15,5,15,6],[15,7,15,8],[12,3,12,4],[12,5,12,6],[12,7,12,8],[13,3,13,4],[13,5,13,6],[13,7,13,8],[10,3,10,4],[10,5,10,6],[24,3,24,4],[24,5,24,6],[24,7,24,8],[25,3,25,4],[25,5,25,6],[25,7,25,8],[22,3,22,4],[22,5,22,6],[22,7,22,8],[23,3,23,4],[23,5,23,6],[23,7,23,8],[20,3,20,4],[20,5,20,6],[20,7,20,8],[21,3,21,4],[21,5,21,6],[21,7,21,8],[30,3,30,4],[30,5,30,6],[30,7,30,8],[31,3,31,4],[31,5,31,6],[31,7,31,8],[28,3,28,4],[28,5,28,6],[28,7,28,8],[29,3,29,4],[29,5,29,6],[29,7,29,8],[26,3,26,4],[26,5,26,6],[26,7,26,8],[27,3,27,4],[27,5,27,6],[27,7,27,8],[36,3,36,4],[36,5,36,6],[36,7,36,8],[37,3,37,4],[37,5,37,6],[37,7,37,8],[34,3,34,4],[34,5,34,6],[34,7,34,8],[35,3,35,4],[35,5,35,6],[35,7,35,8],[32,3,32,4],[32,5,32,6],[32,7,32,8],[33,3,33,4],[33,5,33,6],[33,7,33,8],[42,3,42,4],[42,5,42,6],[42,7,42,8],[43,3,43,4],[43,5,43,6],[43,7,43,8],[40,3,40,4],[40,5,40,6],[40,7,40,8],[41,3,41,4],[41,5,41,6],[41,7,41,8],[38,3,38,4],[38,5,38,6],[38,7,38,8],[39,3,39,4],[39,5,39,6],[39,7,39,8],[48,3,48,4],[48,5,48,6],[48,7,48,8],[49,3,49,4],[49,5,49,6],[49,7,49,8],[46,3,46,4],[46,5,46,6],[46,7,46,8],[47,3,47,4],[47,5,47,6],[47,7,47,8],[44,3,44,4],[44,5,44,6],[44,7,44,8],[45,3,45,4],[45,5,45,6],[45,7,45,8],[54,3,54,4],[54,5,54,6],[54,7,54,8],[55,3,55,4],[55,5,55,6],[55,7,55,8],[52,3,52,4],[52,5,52,6],[52,7,52,8],[53,3,53,4],[53,5,53,6],[53,7,53,8],[50,3,50,4],[50,5,50,6],[50,7,50,8],[51,3,51,4],[51,5,51,6],[51,7,51,8],[60,3,60,4],[60,5,60,6],[60,7,60,8],[61,3,61,4],[61,5,61,6],[61,7,61,8],[58,3,58,4],[58,5,58,6],[58,7,58,8],[59,3,59,4],[59,5,59,6],[59,7,59,8],[56,3,56,4],[56,5,56,6],[56,7,56,8],[57,3,57,4],[57,5,57,6],[57,7,57,8],[66,3,66,4],[66,5,66,6],[66,7,66,8],[67,3,67,4],[67,5,67,6],[67,7,67,8],[64,3,64,4],[64,5,64,6],[64,7,64,8],[65,3,65,4],[65,5,65,6],[65,7,65,8],[62,3,62,4],[62,5,62,6],[62,7,62,8],[63,3,63,4],[63,5,63,6],[63,7,63,8],[72,3,72,4],[72,5,72,6],[72,7,72,8],[73,3,73,4],[73,5,73,6],[73,7,73,8],[70,3,70,4],[70,5,70,6],[70,7,70,8],[71,3,71,4],[71,5,71,6],[71,7,71,8],[68,3,68,4],[68,5,68,6],[68,7,68,8],[69,3,69,4],[69,5,69,6],[69,7,69,8],[78,3,78,4],[78,5,78,6],[78,7,78,8],[79,3,79,4],[79,5,79,6],[79,7,79,8],[76,3,76,4],[76,5,76,6],[76,7,76,8],[77,3,77,4],[77,5,77,6],[77,7,77,8],[74,3,74,4],[74,5,74,6],[74,7,74,8],[75,3,75,4],[75,5,75,6],[75,7,75,8],[84,3,84,4],[84,5,84,6],[84,7,84,8],[85,3,85,4],[85,5,85,6],[85,7,85,8],[82,3,82,4],[82,5,82,6],[82,7,82,8],[83,3,83,4],[83,5,83,6],[83,7,83,8],[80,3,80,4],[80,5,80,6],[80,7,80,8],[81,3,81,4],[81,5,81,6],[81,7,81,8],[90,3,90,4],[90,5,90,6],[90,7,90,8],[91,3,91,4],[91,5,91,6],[91,7,91,8],[88,3,88,4],[88,5,88,6],[88,7,88,8],[89,3,89,4],[89,5,89,6],[89,7,89,8],[86,3,86,4],[86,5,86,6],[86,7,86,8],[87,3,87,4],[87,5,87,6],[87,7,87,8],[96,3,96,4],[96,5,96,6],[96,7,96,8],[97,3,97,4],[97,5,97,6],[97,7,97,8],[94,3,94,4],[94,5,94,6],[94,7,94,8],[95,3,95,4],[95,5,95,6],[95,7,95,8],[92,3,92,4],[92,5,92,6],[92,7,92,8],[93,3,93,4],[93,5,93,6],[93,7,93,8],[102,3,102,4],[102,5,102,6],[102,7,102,8],[103,3,103,4],[103,5,103,6],[103,7,103,8],[100,3,100,4],[100,5,100,6],[100,7,100,8],[101,3,101,4],[101,5,101,6],[101,7,101,8],[98,3,98,4],[98,5,98,6],[98,7,98,8],[99,3,99,4],[99,5,99,6],[99,7,99,8],[108,3,108,4],[108,5,108,6],[108,7,108,8],[109,3,109,4],[109,5,109,6],[109,7,109,8],[106,3,106,4],[106,5,106,6],[106,7,106,8],[107,3,107,4],[107,5,107,6],[107,7,107,8],[104,3,104,4],[104,5,104,6],[104,7,104,8],[105,3,105,4],[105,5,105,6],[105,7,105,8],[114,3,114,4],[114,5,114,6],[114,7,114,8],[115,3,115,4],[115,5,115,6],[115,7,115,8],[112,3,112,4],[112,5,112,6],[112,7,112,8],[113,3,113,4],[113,5,113,6],[113,7,113,8],[110,3,110,4],[110,5,110,6],[110,7,110,8],[111,3,111,4],[111,5,111,6],[111,7,111,8],[120,3,120,4],[120,5,120,6],[120,7,120,8],[121,3,121,4],[121,5,121,6],[121,7,121,8],[118,3,118,4],[118,5,118,6],[118,7,118,8],[119,3,119,4],[119,5,119,6],[119,7,119,8],[116,3,116,4],[116,5,116,6],[116,7,116,8],[117,3,117,4],[117,5,117,6],[117,7,117,8],[126,3,126,4],[126,5,126,6],[126,7,126,8],[127,3,127,4],[127,5,127,6],[127,7,127,8],[124,3,124,4],[124,5,124,6],[124,7,124,8],[125,3,125,4],[125,5,125,6],[125,7,125,8],[122,3,122,4],[122,5,122,6],[122,7,122,8],[123,3,123,4],[123,5,123,6],[123,7,123,8],[132,3,132,4],[132,5,132,6],[132,7,132,8],[133,3,133,4],[133,5,133,6],[133,7,133,8],[130,3,130,4],[130,5,130,6],[130,7,130,8],[131,3,131,4],[131,5,131,6],[131,7,131,8],[128,3,128,4],[128,5,128,6],[128,7,128,8],[129,3,129,4],[129,5,129,6],[129,7,129,8],[138,3,138,4],[138,5,138,6],[138,7,138,8],[139,3,139,4],[139,5,139,6],[139,7,139,8],[136,3,136,4],[136,5,136,6],[136,7,136,8],[137,3,137,4],[137,5,137,6],[137,7,137,8],[134,3,134,4],[134,5,134,6],[134,7,134,8],[135,3,135,4],[135,5,135,6],[135,7,135,8],[144,3,144,4],[144,5,144,6],[144,7,144,8],[145,3,145,4],[145,5,145,6],[145,7,145,8],[142,3,142,4],[142,5,142,6],[142,7,142,8],[143,3,143,4],[143,5,143,6],[143,7,143,8],[140,3,140,4],[140,5,140,6],[140,7,140,8],[141,3,141,4],[141,5,141,6],[141,7,141,8],[150,3,150,4],[150,5,150,6],[150,7,150,8],[151,3,151,4],[151,5,151,6],[151,7,151,8],[148,3,148,4],[148,5,148,6],[148,7,148,8],[149,3,149,4],[149,5,149,6],[149,7,149,8],[146,3,146,4],[146,5,146,6],[146,7,146,8],[147,3,147,4],[147,5,147,6],[147,7,147,8],[156,3,156,4],[156,5,156,6],[156,7,156,8],[157,3,157,4],[157,5,157,6],[157,7,157,8],[154,3,154,4],[154,5,154,6],[154,7,154,8],[155,3,155,4],[155,5,155,6],[155,7,155,8],[152,3,152,4],[152,5,152,6],[152,7,152,8],[153,3,153,4],[153,5,153,6],[153,7,153,8],[162,3,162,4],[162,5,162,6],[162,7,162,8],[163,3,163,4],[163,5,163,6],[163,7,163,8],[160,3,160,4],[160,5,160,6],[160,7,160,8],[161,3,161,4],[161,5,161,6],[161,7,161,8],[158,3,158,4],[158,5,158,6],[158,7,158,8],[159,3,159,4],[159,5,159,6],[159,7,159,8],[168,3,168,4],[168,5,168,6],[168,7,168,8],[169,3,169,4],[169,5,169,6],[169,7,169,8],[166,3,166,4],[166,5,166,6],[166,7,166,8],[167,3,167,4],[167,5,167,6],[167,7,167,8],[164,3,164,4],[164,5,164,6],[164,7,164,8],[165,3,165,4],[165,5,165,6],[165,7,165,8],[174,3,174,4],[174,5,174,6],[174,7,174,8],[175,3,175,4],[175,5,175,6],[175,7,175,8],[172,3,172,4],[172,5,172,6],[172,7,172,8],[173,3,173,4],[173,5,173,6],[173,7,173,8],[170,3,170,4],[170,5,170,6],[170,7,170,8],[171,3,171,4],[171,5,171,6],[171,7,171,8],[180,3,180,4],[180,5,180,6],[180,7,180,8],[181,3,181,4],[181,5,181,6],[181,7,181,8],[178,3,178,4],[178,5,178,6],[178,7,178,8],[179,3,179,4],[179,5,179,6],[179,7,179,8],[176,3,176,4],[176,5,176,6],[176,7,176,8],[177,3,177,4],[177,5,177,6],[177,7,177,8],[186,3,186,4],[186,5,186,6],[186,7,186,8],[187,3,187,4],[187,5,187,6],[187,7,187,8],[184,3,184,4],[184,5,184,6],[184,7,184,8],[185,3,185,4],[185,5,185,6],[185,7,185,8],[182,3,182,4],[182,5,182,6],[182,7,182,8],[183,3,183,4],[183,5,183,6],[183,7,183,8],[192,3,192,4],[192,5,192,6],[192,7,192,8],[193,3,193,4],[193,5,193,6],[193,7,193,8],[190,3,190,4],[190,5,190,6],[190,7,190,8],[191,3,191,4],[191,5,191,6],[191,7,191,8],[188,3,188,4],[188,5,188,6],[188,7,188,8],[189,3,189,4],[189,5,189,6],[189,7,189,8],[198,3,198,4],[198,5,198,6],[198,7,198,8],[199,3,199,4],[199,5,199,6],[199,7,199,8],[196,3,196,4],[196,5,196,6],[196,7,196,8],[197,3,197,4],[197,5,197,6],[197,7,197,8],[194,3,194,4],[194,5,194,6],[194,7,194,8],[195,3,195,4],[195,5,195,6],[195,7,195,8],[204,3,204,4],[204,5,204,6],[204,7,204,8],[205,3,205,4],[205,5,205,6],[205,7,205,8],[202,3,202,4],[202,5,202,6],[202,7,202,8],[203,3,203,4],[203,5,203,6],[203,7,203,8],[200,3,200,4],[200,5,200,6],[200,7,200,8],[201,3,201,4],[201,5,201,6],[201,7,201,8],[210,3,210,4],[210,5,210,6],[210,7,210,8],[211,3,211,4],[211,5,211,6],[211,7,211,8],[208,3,208,4],[208,5,208,6],[208,7,208,8],[209,3,209,4],[209,5,209,6],[209,7,209,8],[206,3,206,4],[206,5,206,6],[206,7,206,8],[207,3,207,4],[207,5,207,6],[207,7,207,8],[216,3,216,4],[216,5,216,6],[216,7,216,8],[217,3,217,4],[217,5,217,6],[217,7,217,8],[214,3,214,4],[214,5,214,6],[214,7,214,8],[215,3,215,4],[215,5,215,6],[215,7,215,8],[212,3,212,4],[212,5,212,6],[212,7,212,8],[213,3,213,4],[213,5,213,6],[213,7,213,8],[222,3,222,4],[222,5,222,6],[222,7,222,8],[223,3,223,4],[223,5,223,6],[223,7,223,8],[220,3,220,4],[220,5,220,6],[220,7,220,8],[221,3,221,4],[221,5,221,6],[221,7,221,8],[218,3,218,4],[218,5,218,6],[218,7,218,8],[219,3,219,4],[219,5,219,6],[219,7,219,8],[228,3,228,4],[228,5,228,6],[228,7,228,8],[229,3,229,4],[229,5,229,6],[229,7,229,8],[226,3,226,4],[226,5,226,6],[226,7,226,8],[227,3,227,4],[227,5,227,6],[227,7,227,8],[224,3,224,4],[224,5,224,6],[224,7,224,8],[225,3,225,4],[225,5,225,6],[225,7,225,8],[234,3,234,4],[234,5,234,6],[234,7,234,8],[235,3,235,4],[235,5,235,6],[235,7,235,8],[232,3,232,4],[232,5,232,6],[232,7,232,8],[233,3,233,4],[233,5,233,6],[233,7,233,8],[230,3,230,4],[230,5,230,6],[230,7,230,8],[231,3,231,4],[231,5,231,6],[231,7,231,8],[240,3,240,4],[240,5,240,6],[240,7,240,8],[241,3,241,4],[241,5,241,6],[241,7,241,8],[238,3,238,4],[238,5,238,6],[238,7,238,8],[239,3,239,4],[239,5,239,6],[239,7,239,8],[236,3,236,4],[236,5,236,6],[236,7,236,8],[237,3,237,4],[237,5,237,6],[237,7,237,8],[246,3,246,4],[246,5,246,6],[246,7,246,8],[247,3,247,4],[247,5,247,6],[247,7,247,8],[244,3,244,4],[244,5,244,6],[244,7,244,8],[245,3,245,4],[245,5,245,6],[245,7,245,8],[242,3,242,4],[242,5,242,6],[242,7,242,8],[243,3,243,4],[243,5,243,6],[243,7,243,8],[252,3,252,4],[252,5,252,6],[252,7,252,8],[253,3,253,4],[253,5,253,6],[253,7,253,8],[250,3,250,4],[250,5,250,6],[250,7,250,8],[251,3,251,4],[251,5,251,6],[251,7,251,8],[248,3,248,4],[248,5,248,6],[248,7,248,8],[249,3,249,4],[249,5,249,6],[249,7,249,8],[258,3,258,4],[258,5,258,6],[258,7,258,8],[259,3,259,4],[259,5,259,6],[259,7,259,8],[256,3,256,4],[256,5,256,6],[256,7,256,8],[257,3,257,4],[257,5,257,6],[257,7,257,8],[254,3,254,4],[254,5,254,6],[254,7,254,8],[255,3,255,4],[255,5,255,6],[255,7,255,8],[264,3,264,4],[264,5,264,6],[264,7,264,8],[265,3,265,4],[265,5,265,6],[265,7,265,8],[262,3,262,4],[262,5,262,6],[262,7,262,8],[263,3,263,4],[263,5,263,6],[263,7,263,8],[260,3,260,4],[260,5,260,6],[260,7,260,8],[261,3,261,4],[261,5,261,6],[261,7,261,8],[270,3,270,4],[270,5,270,6],[270,7,270,8],[271,3,271,4],[271,5,271,6],[271,7,271,8],[268,3,268,4],[268,5,268,6],[268,7,268,8],[269,3,269,4],[269,5,269,6],[269,7,269,8],[266,3,266,4],[266,5,266,6],[266,7,266,8],[267,3,267,4],[267,5,267,6],[267,7,267,8],[276,3,276,4],[276,5,276,6],[276,7,276,8],[277,3,277,4],[277,5,277,6],[277,7,277,8],[274,3,274,4],[274,5,274,6],[274,7,274,8],[275,3,275,4],[275,5,275,6],[275,7,275,8],[272,3,272,4],[272,5,272,6],[272,7,272,8],[273,3,273,4],[273,5,273,6],[273,7,273,8],[282,3,282,4],[282,5,282,6],[282,7,282,8],[283,3,283,4],[283,5,283,6],[283,7,283,8],[280,3,280,4],[280,5,280,6],[280,7,280,8],[281,3,281,4],[281,5,281,6],[281,7,281,8],[278,3,278,4],[278,5,278,6],[278,7,278,8],[279,3,279,4],[279,5,279,6],[279,7,279,8],[288,3,288,4],[288,5,288,6],[288,7,288,8],[289,3,289,4],[289,5,289,6],[289,7,289,8],[286,3,286,4],[286,5,286,6],[286,7,286,8],[287,3,287,4],[287,5,287,6],[287,7,287,8],[284,3,284,4],[284,5,284,6],[284,7,284,8],[285,3,285,4],[285,5,285,6],[285,7,285,8],[294,3,294,4],[294,5,294,6],[294,7,294,8],[295,3,295,4],[295,5,295,6],[295,7,295,8],[292,3,292,4],[292,5,292,6],[292,7,292,8],[293,3,293,4],[293,5,293,6],[293,7,293,8],[290,3,290,4],[290,5,290,6],[290,7,290,8],[291,3,291,4],[291,5,291,6],[291,7,291,8],[300,3,300,4],[300,5,300,6],[300,7,300,8],[301,3,301,4],[301,5,301,6],[301,7,301,8],[298,3,298,4],[298,5,298,6],[298,7,298,8],[299,3,299,4],[299,5,299,6],[299,7,299,8],[296,3,296,4],[296,5,296,6],[296,7,296,8],[297,3,297,4],[297,5,297,6],[297,7,297,8],[306,3,306,4],[306,5,306,6],[306,7,306,8],[307,3,307,4],[307,5,307,6],[307,7,307,8],[304,3,304,4],[304,5,304,6],[304,7,304,8],[305,3,305,4],[305,5,305,6],[305,7,305,8],[302,3,302,4],[302,5,302,6],[302,7,302,8],[303,3,303,4],[303,5,303,6],[303,7,303,8],[312,3,312,4],[312,5,312,6],[312,7,312,8],[313,3,313,4],[313,5,313,6],[313,7,313,8],[310,3,310,4],[310,5,310,6],[310,7,310,8],[311,3,311,4],[311,5,311,6],[311,7,311,8],[308,3,308,4],[308,5,308,6],[308,7,308,8],[309,3,309,4],[309,5,309,6],[309,7,309,8],[318,3,318,4],[318,5,318,6],[318,7,318,8],[319,3,319,4],[319,5,319,6],[319,7,319,8],[316,3,316,4],[316,5,316,6],[316,7,316,8],[317,3,317,4],[317,5,317,6],[317,7,317,8],[314,3,314,4],[314,5,314,6],[314,7,314,8],[315,3,315,4],[315,5,315,6],[315,7,315,8],[324,3,324,4],[324,5,324,6],[324,7,324,8],[325,3,325,4],[325,5,325,6],[325,7,325,8],[322,3,322,4],[322,5,322,6],[322,7,322,8],[323,3,323,4],[323,5,323,6],[323,7,323,8],[320,3,320,4],[320,5,320,6],[320,7,320,8],[321,3,321,4],[321,5,321,6],[321,7,321,8],[330,3,330,4],[330,5,330,6],[330,7,330,8],[331,3,331,4],[331,5,331,6],[331,7,331,8],[328,3,328,4],[328,5,328,6],[328,7,328,8],[329,3,329,4],[329,5,329,6],[329,7,329,8],[326,3,326,4],[326,5,326,6],[326,7,326,8],[327,3,327,4],[327,5,327,6],[327,7,327,8],[336,3,336,4],[336,5,336,6],[336,7,336,8],[337,3,337,4],[337,5,337,6],[337,7,337,8],[334,3,334,4],[334,5,334,6],[334,7,334,8],[335,3,335,4],[335,5,335,6],[335,7,335,8],[332,3,332,4],[332,5,332,6]],"merged_total":2119,"flags":["merged_cut"]}
[null,null,null,null,null,null,{"$f":"VLOOKUP($C$2,CAT!$A:$C,2,FALSE)","v":"4A"}]
["OOAD_UMAE",null,"UMAE HE CMN La Raza",null,null,null,{"$f":"VLOOKUP($C$2,CAT!$A:$C,3,FALSE)","v":"UMAE01"},null,null,null,"TOTAL DE LA GARANTÍA:",null,{"$f":"SUM($N$8:$N$707)","v":320561.40000000002}]
["UNIDAD",null,"HES CMN La Raza",null,null,null,{"$f":"VLOOKUP(C3,CAT!I:J,2,FALSE)","v":"36A1041C2153"}]
["AÑO",null,2023,null,null,null,{"$f":"COUNTIFS(Anexo_T1!$D:$D,$G$1,Anexo_T1!$F:$F,$G$3)","v":3}]
[]
["No.","PAQUETE","CLV_GPO","GRUPO",null,"CLV_ESTUDIO",null,"ESTUDIO",null,"2023\nFecha de emisión y \nnotificación del fallo - Diciembre",null,"Importe sin IVA 2023\n(Fecha de emisión y \nnotificación del fallo - Diciembre)",null,"Garantía proporcional al servicio 10% "]
[null,null,null,null,null,null,null,null,null,"Minimo","Máximo","Minimo","Máximo",0.1]
[1,"II",3,"Estudios Inmunohematología",null,"50.03.01",null,"Hemoclasificación de los sistemas AB0 y Rh (antígeno D) en tarjeta, cassette, columna o placa",null,6036,15090,573420,1433550,143355]
{"$rows_left_out":700}
{"sheet":"PENAS","index":4,"n_rows":262,"n_cols":6,"rows_kept":262,"cut":false,"hidden":false,"merged":[[57,1,58,1],[57,2,58,2],[57,4,58,4],[45,0,46,1],[47,2,53,10],[45,2,46,10],[47,0,53,1],[55,3,56,3],[0,0,1,1],[36,3,37,3],[38,1,39,1],[38,2,39,2],[16,3,17,3],[27,2,34,10],[27,0,34,1],[25,0,26,1],[25,2,26,10],[2,0,14,1],[2,2,14,10],[0,2,1,10],[18,1,19,1],[18,2,19,2],[18,4,19,4],[38,4,39,4],[79,0,80,1],[79,2,80,10],[81,2,85,10],[81,0,85,1],[87,3,88,3],[72,1,73,1],[72,2,73,2],[72,4,73,4],[64,0,65,1],[66,0,68,1],[70,3,71,3],[64,2,65,10],[66,2,68,10],[96,0,97,1],[98,0,104,1],[106,3,107,3],[96,2,97,10],[98,2,104,10],[106,4,107,4],[108,3,109,3],[89,1,90,1],[89,2,90,2],[89,4,90,4],[115,0,116,1],[115,2,116,10],[117,2,122,10],[117,0,122,1],[124,3,125,3],[126,3,127,3],[124,4,125,4],[108,1,109,1],[108,2,109,2],[108,4,109,4],[133,0,134,1],[133,2,134,10],[135,0,140,1],[135,2,140,10],[142,3,143,3],[144,3,145,3],[142,4,143,4],[126,1,127,1],[126,2,127,2],[126,4,127,4],[255,3,256,3],[255,4,256,4],[257,1,258,1],[257,2,258,2],[257,3,258,3],[257,4,258,4],[144,1,145,1],[144,2,145,2],[144,4,145,4],[163,1,164,1],[163,2,164,2],[163,4,164,4],[151,0,153,1],[151,2,153,10],[154,2,159,10],[154,0,159,1],[161,3,162,3],[163,3,164,3],[161,4,162,4],[178,3,179,3],[180,1,181,1],[180,2,181,2],[180,4,181,4],[170,2,171,10],[172,2,176,10],[170,0,171,1],[172,0,176,1],[180,3,181,3],[178,4,179,4],[194,1,195,1],[194,2,195,2],[194,4,195,4],[189,0,190,1],[187,0,188,1],[192,3,193,3],[187,2,188,10],[189,2,190,10],[194,3,195,3],[192,4,193,4],[250,0,251,1],[252,0,253,1],[250,2,251,10],[232,0,236,1],[237,0,239,1],[241,3,242,3],[232,2,236,10],[237,2,239,10],[225,1,226,1],[225,2,226,2],[225,4,226,4],[252,2,253,10],[206,3,207,3],[208,1,209,1],[208,2,209,2],[208,4,209,4],[201,2,202,10],[203,2,204,10],[206,4,207,4],[208,3,209,3],[243,1,244,1],[243,2,244,2],[243,4,244,4],[215,0,219,1],[220,0,221,1],[223,3,224,3],[215,2,219,10],[220,2,221,10],[225,3,226,3],[223,4,224,4],[241,4,242,4],[243,3,244,3],[201,0,202,1],[203,0,204,1],[16,4,17,4],[18,3,19,3],[38,3,39,3],[36,4,37,4],[55,4,56,4],[57,3,58,3],[70,4,71,4],[72,3,73,3],[89,3,90,3],[87,4,88,4]]}
["Pena Convencional 1",null,"Cuando el licitante adjudicado a cada Partida no lleve a cabo la reunión informativa con el total de los Jefes o Encargados de Bancos de Sangre, Centros de Colecta y Servicios de Transfusiones de las Unidades Médicas adjudicadas, en conjunto con el personal de la Coordinación de Planeación de Servicios Médicos de Apoyo en la Coordinación Técnica de Servicios Médicos Indirectos, para hacer del conocimiento los lineamientos del Servicio Médico Integral contratado."]
[]
["Observaciones:",null,"1. El prototipo de este formato es que se tropicalice el ejemplo de esta Unidad Médica a tu propia unidad médica, la celdas de color verde son las Únicas celdas en las que se debe anotar el numero de días de incumplimiento, automáticamente se calcula el monto de la pena convencional.\n2. Plasma la totalidad del requerimiento solo por la unidad médica en cuestión en esta pestaña, con sus respectivos importes mínimos y máximos 2023. Se recomienda Cortar y pegar valores (V). Es importante que pegues la totalidad del requerimiento en esta pestaña, pues de aquí se partirá para generar las siguientes penas convencionales y su proporcionalidad en aquellas penas convencionales que aplique.\n3. Hasta el final del requerimiento se cuenta con el cálculo automático del importe 2023 sin IVA, verifica que corresponda con el monto sin I.V.A. 2023 del contrato (pues varios contratos cuentan con un monto superior al monto adjudicado, en caso de que coincidan los precios procede a utilizar los precios especificados en la pestaña 1 (precios Adjudicados); en caso de que tu contrato refleje un importe mayor al plasmado en la pestaña 1, procede a revisar si este importe coincide con el estipulado en la pestaña Anexo T1; en caso de que coincidan, procede a utilizar el importe del Anexo T1.\n4. Procede a anotar en cada clave de estudio lo estipulado en la columna E, F y G:\n        Columna E: el tipo de procesamiento (si se realiza en el IMSS o en Laboratorio de Referencia)\n        Columna F: lo que se procesa en el IMSS si esta vinculado a un equipo (Si se procesa en equipo o si se procesa con pruebas manuales)\n        Columna G: Nombre del equipo en cuestión o equipos para cada clave de estudio\n4. Para conocer el monto de la penalización, solo basta con pegar las mismas fórmulas en tu requerimiento.\n5. Esta deductiva es por la totalidad del requerimiento, aquí no aplica el criterio de proporcionalidad.\n6. Tus documentos de soporte son la solicitud de la reunión para la presentación del Servicio Médico Integral, esta pena no es aplicable en este momento, pues se llevaron a cabo las reuniones para la presentación del servicio."]
[]
[]
[]
[]
[]
{"$rows_left_out":255}
{"sheet":"RESUMEN","index":5,"n_rows":32,"n_cols":13,"rows_kept":32,"cut":false,"hidden":false,"merged":[[17,1,18,2],[13,1,14,2],[15,1,16,2],[1,1,2,2],[3,1,4,2],[5,1,6,2],[7,1,8,2],[9,1,10,2],[11,1,12,2],[23,3,24,4],[25,3,26,4],[1,3,2,4],[3,3,4,4],[5,3,6,4],[7,3,8,4],[9,3,10,4],[1,12,1,13],[29,3,30,4],[31,3,32,4],[31,1,32,2],[29,1,30,2],[1,10,1,11],[11,3,12,4],[13,3,14,4],[15,3,16,4],[17,3,18,4],[19,3,20,4],[21,3,22,4],[19,1,20,2],[21,1,22,2],[23,1,24,2],[25,1,26,2],[1,5,2,6],[1,7,2,8],[3,5,4,6],[3,7,4,8],[5,5,6,6],[5,7,6,8],[7,5,8,6],[7,7,8,8],[9,5,10,6],[9,7,10,8],[11,5,12,6],[11,7,12,8],[13,5,14,6],[13,7,14,8],[15,5,16,6],[15,7,16,8],[17,5,18,6],[17,7,18,8],[29,5,30,6],[29,7,30,8],[31,5,32,6],[31,7,32,8],[19,5,20,6],[19,7,20,8],[21,5,22,6],[21,7,22,8],[23,5,24,6],[23,7,24,8],[27,1,28,2],[27,3,28,4],[27,5,28,6],[27,7,28,8],[25,5,26,6],[25,7,26,8]]}
[]
[21,"Pena Convencional 1",null,{"$f":"PENAS!$E21","v":0},null,{"$f":"PENAS!$E22","v":17630.877000000004},null,{"$f":"PENAS!$E23","v":0},null,null,"TOTAL DE LA GARANTÍA:",null,{"$f":"ANALITOS!M2","v":320561.40000000002}]
[]
[41,"Pena Convencional 2",null,{"$f":"PENAS!$E41","v":0},null,{"$f":"PENAS!$E42","v":17630.877000000004},null,{"$f":"PENAS!$E43","v":0}]
[]
[60,"Pena Convencional 3",null,{"$f":"PENAS!$E60","v":0},null,{"$f":"PENAS!$E61","v":17630.877000000004},null,{"$f":"PENAS!$E62","v":0}]
[]
[75,"Pena Convencional 4",null,{"$f":"PENAS!$E75","v":0},null,{"$f":"PENAS!$E76","v":14104.701600000002},null,{"$f":"PENAS!$E77","v":0}]
{"$rows_left_out":24}